{"text_format":"1","workbook":"xlsx","n_sheets":2,"sheets":["Intro & Setup","Maths Game"],"not_rendered":{"charts":0,"images":4,"macros":1,"external_links":0,"defined_names":2,"comments":0,"pivot_tables":0},"unopened":[],"bounds":{"document_bytes":16777216,"sheet_cells":100000,"rows_first":2000,"rows_last":500,"rows_between":2000,"halvings":0,"cell_chars":16384,"cell_head_chars":4096},"cells_cut":0,"cells_raw":0,"read":"whole","date_system":"1900"}

{"sheet":"Intro & Setup","index":0,"n_rows":843,"n_cols":73,"rows_kept":843,"cut":false,"hidden":false,"merged":[[12,10,12,14],[14,10,14,14],[12,17,16,44],[34,1,34,19],[35,1,41,19],[18,17,20,44],[42,1,42,19],[42,24,42,42],[12,1,12,9],[14,1,14,9],[16,1,16,9],[31,1,31,9],[31,11,31,19],[34,24,35,42],[23,1,23,9],[23,11,23,19],[23,21,23,36],[23,38,28,44],[24,1,30,9],[24,11,30,19],[24,21,28,36],[16,10,16,14],[8,1,8,44],[9,1,9,44],[10,1,10,44],[1,1,2,44],[4,1,4,44],[6,1,6,6],[6,7,6,44],[7,1,7,6],[7,7,7,44]]}
[]
[null,"Thanks for downloading the Children's Maths Game",null,null,null,null,null,null,null,null,null,null,null,null,null,null,null,null,null,null,null,null,null,null,null,null,null,null,null,null,null,null,null,null,null,null,null,null,null,null,null,null,null,null,null,null,null,null,null,null,null,null,null,null,null,null,null,null,null,null,null,null,"Random","Valid","Rank",null,null,null,null,null,"Paste",null,"Copy"]
[null,null,null,null,null,null,null,null,null,null,null,null,null,null,null,null,null,null,null,null,null,null,null,null,null,null,null,null,null,null,null,null,null,null,null,null,null,null,null,null,null,null,null,null,null,null,null,null,null,null,null,null,null,null,1,"+",1,null,{"$f":"BC3+BE3","v":2},null,{"$f":"IF(COUNTIF($BP$5:$BP$6, $BD3)=0, \"\", IF(OR($BC3>$BP$3, $BE3>$BP$3, $BG3>$BP$3, $BG3<$BP$8), \"\", \"X\"))","v":"X"},null,{"$f":"$BS3","v":155},{"$f":"IF($BI3=\"\", \"\", $BK3)","v":155},{"$f":"IF($BL3=\"\", \"\", COUNTIF($BL$3:$BL$803, \">\"&$BL3)+1+COUNTIF($BL$3:$BL3, $BL3)-1)","v":16},null,"Limit",{"$f":"IF($K$15=\"\", 5, $K$15)","v":5},null,null,155,null,{"$f":"RANDBETWEEN(1, 1000)","v":661}]
[null,null,null,null,null,null,null,null,null,null,null,null,null,null,null,null,null,null,null,null,null,null,null,null,null,null,null,null,null,null,null,null,null,null,null,null,null,null,null,null,null,null,null,null,null,null,null,null,"Well done!",1,6,null,null,null,{"$f":"IF(BC3+1>20, 1, BC3+1)","v":2},"+",{"$f":"IF(BC4=1, BE3+1, BE3)","v":1},null,{"$f":"BC4+BE4","v":3},null,{"$f":"IF(COUNTIF($BP$5:$BP$6, $BD4)=0, \"\", IF(OR($BC4>$BP$3, $BE4>$BP$3, $BG4>$BP$3, $BG4<$BP$8), \"\", \"X\"))","v":"X"},null,{"$f":"$BS4","v":30},{"$f":"IF($BI4=\"\", \"\", $BK4)","v":30},{"$f":"IF($BL4=\"\", \"\", COUNTIF($BL$3:$BL$803, \">\"&$BL4)+1+COUNTIF($BL$3:$BL4, $BL4)-1)","v":19},null,null,null,null,null,30,null,{"$f":"RANDBETWEEN(1, 1000)","v":294}]
[null,"Please read these notes explaining how to use this spreadsheet",null,null,null,null,null,null,null,null,null,null,null,null,null,null,null,null,null,null,null,null,null,null,null,null,null,null,null,null,null,null,null,null,null,null,null,null,null,null,null,null,null,null,null,null,null,null,"Good job!",2,7,null,null,null,{"$f":"IF(BC4+1>20, 1, BC4+1)","v":3},"+",{"$f":"IF(BC5=1, BE4+1, BE4)","v":1},null,{"$f":"BC5+BE5","v":4},null,"X",null,21,21,{"$f":"IF($BL5=\"\", \"\", COUNTIF($BL$3:$BL$803, \">\"&$BL5)+1+COUNTIF($BL$3:$BL5, $BL5)-1)","v":20},null,"Include +",{"$f":"IF(OR($BO$23=$BO$19, $BO$23=$BO$21), \"+\", \"\")","v":"+"},null,null,21,null,103]
[null,null,null,null,null,null,null,null,null,null,null,null,null,null,null,null,null,null,null,null,null,null,null,null,null,null,null,null,null,null,null,null,null,null,null,null,null,null,null,null,null,null,null,null,null,null,null,null,"Excellent!",3,8,null,null,null,4,"+",1,null,5,null,"X",null,969,969,{"$f":"IF($BL6=\"\", \"\", COUNTIF($BL$3:$BL$803, \">\"&$BL6)+1+COUNTIF($BL$3:$BL6, $BL6)-1)","v":2},null,"Include -",{"$f":"IF(OR($BO$23=$BO$20, $BO$23=$BO$21), \"-\", \"\")","v":"-"},null,null,969,null,80]
[null,"Editable Cells",null,null,null,null,null,"The blue background and white writing usually identifies cells where you can enter or edit information.",null,null,null,null,null,null,null,null,null,null,null,null,null,null,null,null,null,null,null,null,null,null,null,null,null,null,null,null,null,null,null,null,null,null,null,null,null,null,null,null,"Correct!",4,9,null,null,null,5,"+",1,null,6,null,"",null,32,"",{"$f":"IF($BL7=\"\", \"\", COUNTIF($BL$3:$BL$803, \">\"&$BL7)+1+COUNTIF($BL$3:$BL7, $BL7)-1)","v":""},null,null,null,null,null,32,null,732]
[null,"Calculated Cells",null,null,null,null,null,"The purple background and white writing usually identifies cells which are calculated, and therefore locked.",null,null,null,null,null,null,null,null,null,null,null,null,null,null,null,null,null,null,null,null,null,null,null,null,null,null,null,null,null,null,null,null,null,null,null,null,null,null,null,null,"Nice work!",5,10,null,null,null,6,"+",1,null,7,null,"",null,49,"",{"$f":"IF($BL8=\"\", \"\", COUNTIF($BL$3:$BL$803, \">\"&$BL8)+1+COUNTIF($BL$3:$BL8, $BL8)-1)","v":""},null,"Lowest",{"$f":"IF($BO$15=$BO$12, 0, 1)","v":1},null,null,49,null,10]
[null,"If you copy and paste data into this spreadsheet (from an internal or external source), ALWAYS use paste VALUES, never normal paste.",null,null,null,null,null,null,null,null,null,null,null,null,null,null,null,null,null,null,null,null,null,null,null,null,null,null,null,null,null,null,null,null,null,null,null,null,null,null,null,null,null,null,null,null,null,null,null,null,null,null,null,null,7,"+",1,null,8,null,"",null,292,"",{"$f":"IF($BL9=\"\", \"\", COUNTIF($BL$3:$BL$803, \">\"&$BL9)+1+COUNTIF($BL$3:$BL9, $BL9)-1)","v":""},null,null,null,null,null,292,null,330]
[null,"Using the drag function is the same as copy and paste, so do not use it.",null,null,null,null,null,null,null,null,null,null,null,null,null,null,null,null,null,null,null,null,null,null,null,null,null,null,null,null,null,null,null,null,null,null,null,null,null,null,null,null,null,null,null,null,null,null,null,null,null,null,null,null,8,"+",1,null,9,null,"",null,603,"",{"$f":"IF($BL10=\"\", \"\", COUNTIF($BL$3:$BL$803, \">\"&$BL10)+1+COUNTIF($BL$3:$BL10, $BL10)-1)","v":""},null,null,null,null,null,603,null,283]
[null,"DO not delete or move data or cells. You can use clear contents, or you can use the sort function where there are filters.",null,null,null,null,null,null,null,null,null,null,null,null,null,null,null,null,null,null,null,null,null,null,null,null,null,null,null,null,null,null,null,null,null,null,null,null,null,null,null,null,null,null,null,null,null,null,null,null,null,null,null,null,9,"+",1,null,10,null,"",null,186,"",{"$f":"IF($BL11=\"\", \"\", COUNTIF($BL$3:$BL$803, \">\"&$BL11)+1+COUNTIF($BL$3:$BL11, $BL11)-1)","v":""},null,null,null,null,null,186,null,404]
[null,null,null,null,null,null,null,null,null,null,null,null,null,null,null,null,null,null,null,null,null,null,null,null,null,null,null,null,null,null,null,null,null,null,null,null,null,null,null,null,null,null,null,null,null,null,null,null,"Try Again!",null,null,null,null,null,10,"+",1,null,11,null,"",null,311,"",{"$f":"IF($BL12=\"\", \"\", COUNTIF($BL$3:$BL$803, \">\"&$BL12)+1+COUNTIF($BL$3:$BL12, $BL12)-1)","v":""},null,"Yes",null,null,null,311,null,950]
[null,"Include Zero Answers",null,null,null,null,null,null,null,null,"No",null,null,null,null,null,null,"You can select whether or not to include zero answers. Selecting 'Yes' will have formulas like 2 - 2 which result in a 0 answer. Selecting 'No' will exclude such formulas.\nYou can state the maximum value to use, this includes values anywhere in the formulas and answers, thenumber selected will be the highest number shown anywhere.\nYou can select to include only addition, only subtraction, or both.\nAll of these selctions have defaults if left blank.",null,null,null,null,null,null,null,null,null,null,null,null,null,null,null,null,null,null,null,null,null,null,null,null,null,null,null,null,null,null,null,null,null,null,null,null,11,"+",1,null,12,null,"",null,438,"",{"$f":"IF($BL13=\"\", \"\", COUNTIF($BL$3:$BL$803, \">\"&$BL13)+1+COUNTIF($BL$3:$BL13, $BL13)-1)","v":""},null,"No",null,null,null,438,null,548]
[null,null,null,null,null,null,null,null,null,null,null,null,null,null,null,null,null,null,null,null,null,null,null,null,null,null,null,null,null,null,null,null,null,null,null,null,null,null,null,null,null,null,null,null,null,null,null,null,{"$f":"$AW4","v":"Well done!"},{"$f":"COUNTIF($BA$14:$BA$23, \">\"&$BA14)+1+COUNTIF($BA$14:$BA14, $BA14)-1","v":6},null,null,{"$f":"$BS804","v":528},null,12,"+",1,null,13,null,"",null,451,"",{"$f":"IF($BL14=\"\", \"\", COUNTIF($BL$3:$BL$803, \">\"&$BL14)+1+COUNTIF($BL$3:$BL14, $BL14)-1)","v":""},null,null,null,null,null,451,null,465]
[null,"Maximum Value Limit",null,null,null,null,null,null,null,null,5,null,null,null,null,null,null,null,null,null,null,null,null,null,null,null,null,null,null,null,null,null,null,null,null,null,null,null,null,null,null,null,null,null,null,null,null,null,{"$f":"$AW5","v":"Good job!"},{"$f":"COUNTIF($BA$14:$BA$23, \">\"&$BA15)+1+COUNTIF($BA$14:$BA15, $BA15)-1","v":3},null,null,{"$f":"$BS805","v":848},null,13,"+",1,null,14,null,"",null,198,"",{"$f":"IF($BL15=\"\", \"\", COUNTIF($BL$3:$BL$803, \">\"&$BL15)+1+COUNTIF($BL$3:$BL15, $BL15)-1)","v":""},null,{"$f":"IF($K$13=$BO$12, $BO$12, $BO$13)","v":"No"},null,null,null,198,null,299]
[null,null,null,null,null,null,null,null,null,null,null,null,null,null,null,null,null,null,null,null,null,null,null,null,null,null,null,null,null,null,null,null,null,null,null,null,null,null,null,null,null,null,null,null,null,null,null,null,"Excellent!",{"$f":"COUNTIF($BA$14:$BA$23, \">\"&$BA16)+1+COUNTIF($BA$14:$BA16, $BA16)-1","v":4},null,null,722,null,14,"+",1,null,15,null,"",null,442,"",{"$f":"IF($BL16=\"\", \"\", COUNTIF($BL$3:$BL$803, \">\"&$BL16)+1+COUNTIF($BL$3:$BL16, $BL16)-1)","v":""},null,null,null,null,null,442,null,461]
[null,"Formulas to Include",null,null,null,null,null,null,null,null,"Both + & -",null,null,null,null,null,null,null,null,null,null,null,null,null,null,null,null,null,null,null,null,null,null,null,null,null,null,null,null,null,null,null,null,null,null,null,null,null,"Correct!",{"$f":"COUNTIF($BA$14:$BA$23, \">\"&$BA17)+1+COUNTIF($BA$14:$BA17, $BA17)-1","v":5},null,null,610,null,15,"+",1,null,16,null,"",null,664,"",{"$f":"IF($BL17=\"\", \"\", COUNTIF($BL$3:$BL$803, \">\"&$BL17)+1+COUNTIF($BL$3:$BL17, $BL17)-1)","v":""},null,null,null,null,null,664,null,804]
[null,null,null,null,null,null,null,null,null,null,null,null,null,null,null,null,null,null,null,null,null,null,null,null,null,null,null,null,null,null,null,null,null,null,null,null,null,null,null,null,null,null,null,null,null,null,null,null,"Nice work!",{"$f":"COUNTIF($BA$14:$BA$23, \">\"&$BA18)+1+COUNTIF($BA$14:$BA18, $BA18)-1","v":9},null,null,260,null,16,"+",1,null,17,null,"",null,745,"",{"$f":"IF($BL18=\"\", \"\", COUNTIF($BL$3:$BL$803, \">\"&$BL18)+1+COUNTIF($BL$3:$BL18, $BL18)-1)","v":""},null,null,null,null,null,745,null,977]
[null,null,null,null,null,null,null,null,null,null,null,null,null,null,null,null,null,"Once set up, simply get the child to type the answer next to each question. If they get it right, it tells them. If they get it wrong, it encourages them to try again. When complete, click the 'Reset Game' red block, and it will give another set of questions and clear the answers.",null,null,null,null,null,null,null,null,null,null,null,null,null,null,null,null,null,null,null,null,null,null,null,null,null,null,null,null,null,null,{"$f":"$AW4","v":"Well done!"},{"$f":"COUNTIF($BA$14:$BA$23, \">\"&$BA19)+1+COUNTIF($BA$14:$BA19, $BA19)-1","v":7},null,null,388,null,17,"+",1,null,18,null,"",null,206,"",{"$f":"IF($BL19=\"\", \"\", COUNTIF($BL$3:$BL$803, \">\"&$BL19)+1+COUNTIF($BL$3:$BL19, $BL19)-1)","v":""},null,{"$f":"\"+ Only\"","v":"+ Only"},null,null,null,206,null,903]
[null,null,null,null,null,null,null,null,null,null,null,null,null,null,null,null,null,null,null,null,null,null,null,null,null,null,null,null,null,null,null,null,null,null,null,null,null,null,null,null,null,null,null,null,null,null,null,null,{"$f":"$AW5","v":"Good job!"},{"$f":"COUNTIF($BA$14:$BA$23, \">\"&$BA20)+1+COUNTIF($BA$14:$BA20, $BA20)-1","v":10},null,null,17,null,18,"+",1,null,19,null,"",null,766,"",{"$f":"IF($BL20=\"\", \"\", COUNTIF($BL$3:$BL$803, \">\"&$BL20)+1+COUNTIF($BL$3:$BL20, $BL20)-1)","v":""},null,{"$f":"\"- Only\"","v":"- Only"},null,null,null,766,null,607]
{"$rows_left_out":824}
{"sheet":"Maths Game","index":1,"n_rows":31,"n_cols":118,"rows_kept":31,"cut":false,"hidden":false,"merged":[[30,74,34,78],[30,41,34,45],[30,46,34,48],[30,49,34,53],[30,54,34,56],[30,57,34,61],[30,63,34,72],[16,74,20,78],[23,41,27,45],[23,46,27,48],[23,49,27,53],[23,54,27,56],[23,57,27,61],[23,63,27,72],[23,74,27,78],[16,41,20,45],[16,46,20,48],[16,49,20,53],[16,54,20,56],[16,57,20,61],[16,63,20,72],[2,74,6,78],[9,41,13,45],[9,46,13,48],[9,49,13,53],[9,54,13,56],[9,57,13,61],[9,63,13,72],[9,74,13,78],[2,41,6,45],[2,46,6,48],[2,49,6,53],[2,54,6,56],[2,57,6,61],[2,63,6,72],[23,23,27,32],[30,23,34,32],[2,34,6,38],[9,34,13,38],[16,34,20,38],[23,34,27,38],[30,34,34,38],[2,23,6,32],[9,23,13,32],[16,23,20,32],[30,1,34,5],[30,6,34,8],[30,9,34,13],[30,14,34,16],[30,17,34,21],[16,1,20,5],[16,6,20,8],[16,9,20,13],[16,14,20,16],[16,17,20,21],[23,1,27,5],[23,6,27,8],[23,9,27,13],[23,14,27,16],[23,17,27,21],[2,1,6,5],[2,6,6,8],[2,9,6,13],[2,14,6,16],[2,17,6,21],[9,1,13,5],[9,6,13,8],[9,9,13,13],[9,14,13,16],[9,17,13,21],[2,92,6,96],[9,92,13,96],[16,92,20,96],[23,92,27,96],[30,92,34,96],[2,99,6,103],[9,99,13,103],[16,99,20,103],[23,99,27,103],[30,99,34,103]]}
[]
[]
[1,{"$f":"IFERROR(INDEX('Intro & Setup'!$BC$3:$BC$803, MATCH(A3, 'Intro & Setup'!$BM$3:$BM$803, 0)), \"\")","v":3},null,null,null,null,{"$f":"IFERROR(INDEX('Intro & Setup'!$BD$3:$BD$803, MATCH(A3, 'Intro & Setup'!$BM$3:$BM$803, 0)), \"\")","v":"-"},null,null,{"$f":"IFERROR(INDEX('Intro & Setup'!$BE$3:$BE$803, MATCH(A3, 'Intro & Setup'!$BM$3:$BM$803, 0)), \"\")","v":1},null,null,null,null,"=",null,null,null,null,null,null,null,null,{"$f":"IF($CO3=\"\", \"\", IF($CO3=$DN$3, IFERROR(INDEX('Intro & Setup'!$AW$14:$AW$23, MATCH(A3, 'Intro & Setup'!$AX$14:$AX$23, 0)), 'Intro & Setup'!$AW$14), IF($CO3=$DN$4, 'Intro & Setup'!$AW$12, \"\")))","v":""},null,null,null,null,null,null,null,null,null,null,{"$f":"IF($CO3=$DN$3, IFERROR(INDEX('Intro & Setup'!$AW$26:$AW$55, MATCH(A3, 'Intro & Setup'!$AX$26:$AX$55, 0)), 'Intro & Setup'!$AW$26), \"\")","v":""},null,null,null,null,null,{"$f":"A31+1","v":6},{"$f":"IFERROR(INDEX('Intro & Setup'!$BC$3:$BC$803, MATCH(AO3, 'Intro & Setup'!$BM$3:$BM$803, 0)), \"\")","v":2},null,null,null,null,{"$f":"IFERROR(INDEX('Intro & Setup'!$BD$3:$BD$803, MATCH(AO3, 'Intro & Setup'!$BM$3:$BM$803, 0)), \"\")","v":"+"},null,null,{"$f":"IFERROR(INDEX('Intro & Setup'!$BE$3:$BE$803, MATCH(AO3, 'Intro & Setup'!$BM$3:$BM$803, 0)), \"\")","v":2},null,null,null,null,"=",null,null,null,null,null,null,null,null,{"$f":"IF($CV3=\"\", \"\", IF($CV3=$DN$3, IFERROR(INDEX('Intro & Setup'!$AW$14:$AW$23, MATCH(AO3, 'Intro & Setup'!$AX$14:$AX$23, 0)), 'Intro & Setup'!$AW$14), IF($CV3=$DN$4, 'Intro & Setup'!$AW$12, \"\")))","v":""},null,null,null,null,null,null,null,null,null,null,{"$f":"IF($CV3=$DN$3, IFERROR(INDEX('Intro & Setup'!$AW$26:$AW$55, MATCH(AO3, 'Intro & Setup'!$AX$26:$AX$55, 0)), 'Intro & Setup'!$AW$26), \"\")","v":""},null,null,null,null,null,null,null,null,null,null,null,null,null,null,null,null,null,{"$f":"IF($R3=\"\", \"\", IF($G3=\"+\", IF($B3+$J3=$R3, $DN$3, $DN$4), IF($G3=\"-\", IF($B3-$J3=$R3, $DN$3, $DN$4), \"\")))","v":""},null,null,null,null,null,null,{"$f":"IF($BF3=\"\", \"\", IF($AU3=\"+\", IF($AP3+$AX3=$BF3, $DN$3, $DN$4), IF($AU3=\"-\", IF($AP3-$AX3=$BF3, $DN$3, $DN$4), \"\")))","v":""},null,null,null,null,null,null,null,null,null,null,null,null,null,null,null,null,null,"Yes"]
[null,null,null,null,null,null,null,null,null,null,null,null,null,null,null,null,null,null,null,null,null,null,null,null,null,null,null,null,null,null,null,null,null,null,null,null,null,null,null,null,null,null,null,null,null,null,null,null,null,null,null,null,null,null,null,null,null,null,null,null,null,null,null,null,null,null,null,null,null,null,null,null,null,null,null,null,null,null,null,null,null,null,null,null,null,null,null,null,null,null,null,null,null,null,null,null,null,null,null,null,null,null,null,null,null,null,null,null,null,null,null,null,null,null,null,null,null,"No"]
[]
[]
[]
[]
[]
[{"$f":"A3+1","v":2},{"$f":"IFERROR(INDEX('Intro & Setup'!$BC$3:$BC$803, MATCH(A10, 'Intro & Setup'!$BM$3:$BM$803, 0)), \"\")","v":4},null,null,null,null,{"$f":"IFERROR(INDEX('Intro & Setup'!$BD$3:$BD$803, MATCH(A10, 'Intro & Setup'!$BM$3:$BM$803, 0)), \"\")","v":"+"},null,null,{"$f":"IFERROR(INDEX('Intro & Setup'!$BE$3:$BE$803, MATCH(A10, 'Intro & Setup'!$BM$3:$BM$803, 0)), \"\")","v":1},null,null,null,null,"=",null,null,null,null,null,null,null,null,{"$f":"IF($CO10=\"\", \"\", IF($CO10=$DN$3, IFERROR(INDEX('Intro & Setup'!$AW$14:$AW$23, MATCH(A10, 'Intro & Setup'!$AX$14:$AX$23, 0)), 'Intro & Setup'!$AW$14), IF($CO10=$DN$4, 'Intro & Setup'!$AW$12, \"\")))","v":""},null,null,null,null,null,null,null,null,null,null,{"$f":"IF($CO10=$DN$3, IFERROR(INDEX('Intro & Setup'!$AW$26:$AW$55, MATCH(A10, 'Intro & Setup'!$AX$26:$AX$55, 0)), 'Intro & Setup'!$AW$26), \"\")","v":""},null,null,null,null,null,{"$f":"AO3+1","v":7},{"$f":"IFERROR(INDEX('Intro & Setup'!$BC$3:$BC$803, MATCH(AO10, 'Intro & Setup'!$BM$3:$BM$803, 0)), \"\")","v":4},null,null,null,null,{"$f":"IFERROR(INDEX('Intro & Setup'!$BD$3:$BD$803, MATCH(AO10, 'Intro & Setup'!$BM$3:$BM$803, 0)), \"\")","v":"-"},null,null,{"$f":"IFERROR(INDEX('Intro & Setup'!$BE$3:$BE$803, MATCH(AO10, 'Intro & Setup'!$BM$3:$BM$803, 0)), \"\")","v":1},null,null,null,null,"=",null,null,null,null,null,null,null,null,{"$f":"IF($CV10=\"\", \"\", IF($CV10=$DN$3, IFERROR(INDEX('Intro & Setup'!$AW$14:$AW$23, MATCH(AO10, 'Intro & Setup'!$AX$14:$AX$23, 0)), 'Intro & Setup'!$AW$14), IF($CV10=$DN$4, 'Intro & Setup'!$AW$12, \"\")))","v":""},null,null,null,null,null,null,null,null,null,null,{"$f":"IF($CV10=$DN$3, IFERROR(INDEX('Intro & Setup'!$AW$26:$AW$55, MATCH(AO10, 'Intro & Setup'!$AX$26:$AX$55, 0)), 'Intro & Setup'!$AW$26), \"\")","v":""},null,null,null,null,null,null,null,null,null,null,null,null,null,null,null,null,null,{"$f":"IF($R10=\"\", \"\", IF($G10=\"+\", IF($B10+$J10=$R10, $DN$3, $DN$4), IF($G10=\"-\", IF($B10-$J10=$R10, $DN$3, $DN$4), \"\")))","v":""},null,null,null,null,null,null,{"$f":"IF($BF10=\"\", \"\", IF($AU10=\"+\", IF($AP10+$AX10=$BF10, $DN$3, $DN$4), IF($AU10=\"-\", IF($AP10-$AX10=$BF10, $DN$3, $DN$4), \"\")))","v":""}]
[]
[]
[]
[]
[]
[]
[{"$f":"A10+1","v":3},{"$f":"IFERROR(INDEX('Intro & Setup'!$BC$3:$BC$803, MATCH(A17, 'Intro & Setup'!$BM$3:$BM$803, 0)), \"\")","v":5},null,null,null,null,{"$f":"IFERROR(INDEX('Intro & Setup'!$BD$3:$BD$803, MATCH(A17, 'Intro & Setup'!$BM$3:$BM$803, 0)), \"\")","v":"-"},null,null,{"$f":"IFERROR(INDEX('Intro & Setup'!$BE$3:$BE$803, MATCH(A17, 'Intro & Setup'!$BM$3:$BM$803, 0)), \"\")","v":1},null,null,null,null,"=",null,null,null,null,null,null,null,null,{"$f":"IF($CO17=\"\", \"\", IF($CO17=$DN$3, IFERROR(INDEX('Intro & Setup'!$AW$14:$AW$23, MATCH(A17, 'Intro & Setup'!$AX$14:$AX$23, 0)), 'Intro & Setup'!$AW$14), IF($CO17=$DN$4, 'Intro & Setup'!$AW$12, \"\")))","v":""},null,null,null,null,null,null,null,null,null,null,{"$f":"IF($CO17=$DN$3, IFERROR(INDEX('Intro & Setup'!$AW$26:$AW$55, MATCH(A17, 'Intro & Setup'!$AX$26:$AX$55, 0)), 'Intro & Setup'!$AW$26), \"\")","v":""},null,null,null,null,null,{"$f":"AO10+1","v":8},{"$f":"IFERROR(INDEX('Intro & Setup'!$BC$3:$BC$803, MATCH(AO17, 'Intro & Setup'!$BM$3:$BM$803, 0)), \"\")","v":5},null,null,null,null,{"$f":"IFERROR(INDEX('Intro & Setup'!$BD$3:$BD$803, MATCH(AO17, 'Intro & Setup'!$BM$3:$BM$803, 0)), \"\")","v":"-"},null,null,{"$f":"IFERROR(INDEX('Intro & Setup'!$BE$3:$BE$803, MATCH(AO17, 'Intro & Setup'!$BM$3:$BM$803, 0)), \"\")","v":4},null,null,null,null,"=",null,null,null,null,null,null,null,null,{"$f":"IF($CV17=\"\", \"\", IF($CV17=$DN$3, IFERROR(INDEX('Intro & Setup'!$AW$14:$AW$23, MATCH(AO17, 'Intro & Setup'!$AX$14:$AX$23, 0)), 'Intro & Setup'!$AW$14), IF($CV17=$DN$4, 'Intro & Setup'!$AW$12, \"\")))","v":""},null,null,null,null,null,null,null,null,null,null,{"$f":"IF($CV17=$DN$3, IFERROR(INDEX('Intro & Setup'!$AW$26:$AW$55, MATCH(AO17, 'Intro & Setup'!$AX$26:$AX$55, 0)), 'Intro & Setup'!$AW$26), \"\")","v":""},null,null,null,null,null,null,null,null,null,null,null,null,null,null,null,null,null,{"$f":"IF($R17=\"\", \"\", IF($G17=\"+\", IF($B17+$J17=$R17, $DN$3, $DN$4), IF($G17=\"-\", IF($B17-$J17=$R17, $DN$3, $DN$4), \"\")))","v":""},null,null,null,null,null,null,{"$f":"IF($BF17=\"\", \"\", IF($AU17=\"+\", IF($AP17+$AX17=$BF17, $DN$3, $DN$4), IF($AU17=\"-\", IF($AP17-$AX17=$BF17, $DN$3, $DN$4), \"\")))","v":""}]
[]
[]
[]
{"$rows_left_out":11}